wxWindows Kompilierung scheitert...

Diskutiere mit über: wxWindows Kompilierung scheitert... im Mac OS X - Unix & Terminal Forum

  1. minos5000

    minos5000 Thread Starter MacUser Mitglied

    Beiträge:
    165
    Zustimmungen:
    1
    Registriert seit:
    10.02.2004
    Jo, ich hoffe jmd kann mir bei der Installation helfen. Dabei handelt es sich um wxWindows 2.4.2.

    Nach ./configure wird folgendes ausgespuckt:

    Code:
    Configured wxWindows 2.4.2 for `powerpc-apple-darwin7.3.0'
    
      Which GUI toolkit should wxWindows use?                 MAC
      Should wxWindows be compiled in debug mode?             no
      Should wxWindows be linked as a shared library?         yes
      Should wxWindows be compiled in Unicode mode?           no
      What level of wxWindows compatibility should be enabled?
                                           wxWindows 2.0      no
                                           wxWindows 2.2      yes
      Which libraries should wxWindows use?
                                           jpeg               builtin
                                           png                builtin
                                           regex              sys
                                           tiff               builtin
                                           zlib               sys
    
    und dann:
    Code:
    MeinComputer:~/Downloads/28062004/wxMac-2.4.2 MeinComputer$ make
    c++ -c   -I./lib/wx/include/mac-2.4 -I./include -I./src/png -I./src/jpeg -I./src/tiff -D_FILE_OFFSET_BITS=64 -D_LARGE_FILES -no-cpp-precomp -fpascal-strings -I./src/mac/morefile -I/Developer/Headers/FlatCarbon    -D__WXMAC__ -DWXMAKINGDLL  -O2 -MMD -fno-common -Wall -dynamic -fPIC -o dc.o ./src/mac/dc.cpp
    src/mac/dc.cpp:1259: error: parse error before `<<' token
    src/mac/dc.cpp:1263: error: parse error before `short'
    make: *** [dc.o] Error 1
    

    so long
     
  2. canfAN

    canfAN MacUser Mitglied

    Beiträge:
    66
    Zustimmungen:
    0
    Registriert seit:
    06.02.2003
    Das Problem existiert nur unter Panther, du musst dir die cvs-Version besorgen.
    Falls du cvs installiert hast versuche folgendes:



    Oder sieh dich hier mal um:
    http://www.wxwidgets.org/cvs.htm
     
    Zuletzt von einem Moderator bearbeitet: 25.10.2015

Diese Seite empfehlen

Benutzerdefinierte Suche